{"text_format":"3","workbook":"xlsx","n_sheets":17,"sheets":["Инструкция","Титульный","Параметры","Территории","Информация о тарифе","Тепловая энергия","Горячая вода (по компонентам)","Плата за подключение","Формы 12-13","Публикация информации","Комментарий","Ошибки и предупреждения","Columns","Rows","Reference","RegistryMunicipal","SheetList"],"not_rendered":{"images":18,"macros":1,"external_links":3,"defined_names":210},"read":"whole","date_system":"1900"}

{"sheet":"Инструкция","index":0,"n_rows":173,"n_cols":16,"rows_kept":173,"merged":[[1,1,1,6],[2,1,2,2],[4,1,4,24],[6,4,22,23],[25,5,25,12],[25,15,25,23],[26,5,26,12],[26,15,26,23],[27,15,27,23],[43,4,61,23],[63,4,63,23],[64,4,64,5],[64,6,64,10],[65,4,65,5],[65,6,65,9],[81,4,99,23],[100,4,100,23],[101,5,103,23],[104,5,104,23],[105,6,143,23],[145,4,146,23],[147,5,156,23],[157,5,157,18],[159,5,159,23],[170,1,170,24],[171,1,171,24],[172,4,172,16]]}
[]
[null,{"$f":"\"Код шаблона: \" & Getcode()","v":"Код шаблона: ELPASS.JKH.OPEN.INFO.PRICE.WARM"}]
[null,{"$f":"\"Версия \" & Getversion() & \" от \" & GetTemplateDate()","v":"Версия 1.0 от 01.10.2017"}]
[]
[null,{"$f":"GetTemplateName()","v":"Показатели, подлежащие раскрытию в сфере теплоснабжения и сфере оказания услуг по передаче тепловой энергии (цены и тарифы)"}]
[]
[{"$nulls":4},"• На рабочем месте должна быть установлена полная версия приложения Microsoft Office Excel 2007 SP3, 2010, 2013, 2016. Microsoft Office Excel 2003 или иные офисные пакеты не поддерживаются.\n\n• Для корректной работы отчёта требуется включить макросы и выбрать низкий уровень безопасности:\nВ меню MS Excel 2007/2010: Параметры Excel | Центр управления безопасностью | Параметры центра управления безопасностью | Параметры макросов | Включить все макросы | ОК\n\n• Не рекомендуется снимать защиту с листов и каким-либо образом модифицировать защищаемые формулы и расчётные поля. В случае внесения несанкционированных изменений отчёт будет отклонён системой\n\n• При сохранении не следует выбирать формат XLSX (Книга Excel), так как в указанном формате макросы, необходимые для работы отчёта, безвозвратно удаляются, а также форматы XLS или XLSB. Должен использоваться формат XLSM\n\n"]
{"$rows_empty":18}
[{"$nulls":4},"A"," - не обязательные для заполнения",{"$nulls":8},"A"," - обязательные для заполнения"]
[{"$nulls":4},"A"," - заполняемые автоматически",{"$nulls":8},"A"," - незаполняемые поля"]
{"$rows_left_out":30}
{"sheet":"Титульный","index":1,"n_rows":45,"n_cols":5,"rows_kept":45,"merged":[[3,3,3,4],[9,3,9,4],[17,3,17,4],[22,3,22,4],[26,3,26,4],[32,3,32,4],[38,3,38,4]]}
[]
[]
[{"$nulls":3},{"$f":"Getcode()","v":"ELPASS.JKH.OPEN.INFO.PRICE.WARM"},{"$f":"Инструкция!version","v":"Версия 1.0 от 01.10.2017"}]
[{"$nulls":3},{"$f":"GetTemplateName()","v":"Показатели, подлежащие раскрытию в сфере теплоснабжения и сфере оказания услуг по передаче тепловой энергии (цены и тарифы)"}]
[]
[{"$nulls":3},"Субъект РФ","Республика Башкортостан"]
[]
[{"$nulls":3},"Отчетный период","2018"]
[]
[{"$nulls":3},"Сведения о регулируемой организации"]
{"$rows_left_out":36}
{"sheet":"Параметры","index":2,"n_rows":23,"n_cols":6,"rows_kept":23,"merged":[[3,3,5,5],[8,3,8,4],[9,3,9,4],[10,3,10,4],[12,3,12,4],[13,3,13,4],[15,3,15,4],[16,3,16,4],[17,3,17,4],[19,3,20,3],[21,3,21,4],[22,3,22,4]]}
[]
[]
[{"$nulls":3},{"$f":"Getcode()","v":"ELPASS.JKH.OPEN.INFO.PRICE.WARM"},null,{"$f":"Инструкция!version","v":"Версия 1.0 от 01.10.2017"}]
[{"$nulls":3},{"$f":"GetTemplateName()","v":"Показатели, подлежащие раскрытию в сфере теплоснабжения и сфере оказания услуг по передаче тепловой энергии (цены и тарифы)"}]
[]
[]
[]
[]
[{"$nulls":3},"Вид деятельности",null,"Производство тепловой энергии (мощности) не в режиме комбинированной выработки электрической и тепловой энергии источниками тепловой энергии"]
[{"$nulls":3},"Тариф",null,"Тариф на тепловую энергию (мощность)"]
{"$rows_left_out":14}
{"sheet":"Территории","index":3,"n_rows":11,"n_cols":35,"rows_kept":11,"merged":[[0,11,0,12],[2,1,2,12],[3,1,3,12],[5,1,5,3],[5,4,5,7],[5,9,5,11],[6,1,6,2],[6,4,6,6],[6,8,6,10],[7,1,9,1],[7,2,9,2],[7,3,9,3],[7,4,8,4],[7,5,8,5],[7,6,8,6],[7,7,8,7],[8,8,8,9],[8,11,8,12],[10,3,10,4]]}
[null,{"$f":"Getcode()","v":"ELPASS.JKH.OPEN.INFO.PRICE.WARM"},{"$nulls":9},{"$f":"Инструкция!version","v":"Версия 1.0 от 01.10.2017"}]
[]
[null,"Информация о территориях действия тарифов (оказания услуг) регулируемой организации "]
[null,"ООО \"Мечел-энерго\""]
[]
[null,"Территория",null,null,"Городской округ / муниципальный район",{"$nulls":4},"Муниципальное образование"]
[null,"№ п/п",null,"Наименование","№ п/п",null,null,"Наименование","№ п/п",null,null,"Наименование","ОКТМО","Имя диапазона"]
[null,null,1,"Белорецкий муниципальный район (80611101)","МР",null,1,"Белорецкий муниципальный район","МО",null,1,"Город Белорецк",80611101,null,"MO_LIST_12"]
[{"$nulls":11},"Добавить МО",{"$nulls":22},"add_MO_range"]
[{"$nulls":7},"Добавить ГО / МР",{"$nulls":22},"add_MR_range"]
{"$rows_left_out":2}
{"sheet":"Информация о тарифе","index":4,"n_rows":27,"n_cols":38,"rows_kept":27,"hidden":true,"merged":[[3,3,4,23],[5,3,5,23],[7,3,12,5],[7,6,12,8],[7,9,12,11],[7,12,12,12],[7,13,12,13],[7,14,8,15],[7,16,12,18],[7,19,7,22],[7,23,12,23],[8,19,10,20],[8,21,8,22],[9,14,12,14],[9,15,12,15],[9,21,12,21],[9,22,12,22],[11,19,12,19],[11,20,12,20],[13,3,13,5],[13,6,13,8],[13,9,13,11],[13,16,13,18],[14,3,18,3],[14,4,18,4],[14,5,18,5],[14,6,17,6],[14,7,17,7],[14,8,17,8],[14,9,16,9],[14,10,16,10],[14,11,16,11],[14,12,16,12],[14,13,16,13],[14,14,15,14],[14,15,15,15],[15,18,15,21],[17,11,17,12],[18,8,18,9],[19,5,19,6],[22,3,24,11],[26,3,33,11]]}
["f"]
[]
[{"$nulls":3},{"$f":"Getcode()","v":"ELPASS.JKH.OPEN.INFO.PRICE.WARM"},{"$nulls":19},{"$f":"Инструкция!version","v":"Версия 1.0 от 01.10.2017"}]
[{"$nulls":3},"Информация о плате за услуги по поддержанию резервной тепловой мощности при отсутствии потребления тепловой энергии"]
[]
[{"$nulls":3},"ООО \"Мечел-энерго\""]
[]
[{"$nulls":3},"Территория действия тарифа",null,null,"Система теплоснабжения",null,null,"Условия применения\nдифференциации*",null,null,"Группа \nпотребителей **","с НДС","Срок действия тарифа",null,"Вид теплоносителя",null,null,"Величина установленного тарифа",{"$nulls":3},"Примечание"]
[{"$nulls":19},"Одноставочный тариф",null,"Двухставочный тариф"]
[{"$nulls":14},"Дата начала","Дата окончания",{"$nulls":5},"Ставка за энергию, руб./Гкал","Ставка за содержание мощности, руб./Гкал в час"]
{"$rows_left_out":18}
{"sheet":"Тепловая энергия","index":5,"n_rows":28,"n_cols":38,"rows_kept":28,"merged":[[3,3,4,23],[5,3,5,23],[7,3,12,5],[7,6,12,8],[7,9,12,11],[7,12,12,12],[7,13,12,13],[7,14,8,15],[7,16,12,19],[7,20,7,22],[7,23,12,23],[8,20,12,20],[8,21,8,22],[9,14,12,14],[9,15,12,15],[9,21,12,21],[9,22,12,22],[13,3,13,5],[13,6,13,8],[13,9,13,11],[13,16,13,19],[14,3,19,3],[14,4,19,4],[14,5,19,5],[14,6,18,6],[14,7,18,7],[14,8,18,8],[14,9,17,9],[14,10,17,10],[14,11,17,11],[14,12,17,12],[14,13,17,13],[14,14,16,14],[14,15,16,15],[14,16,15,16],[14,17,15,17],[14,18,15,18],[16,18,16,19],[18,11,18,12],[19,8,19,9],[20,5,20,6],[23,3,25,11],[27,3,34,11]]}
["f"]
[]
[{"$nulls":3},{"$f":"Getcode()","v":"ELPASS.JKH.OPEN.INFO.PRICE.WARM"},{"$nulls":19},{"$f":"Инструкция!version","v":"Версия 1.0 от 01.10.2017"}]
[{"$nulls":3},"Информация о тарифе на тепловую энергию (мощность)"]
[]
[{"$nulls":3},"ООО \"Мечел-энерго\""]
[]
[{"$nulls":3},"Территория действия тарифа",null,null,"Система теплоснабжения",null,null,"Условия применения\nдифференциации*",null,null,"Группа \nпотребителей **","с НДС","Срок действия тарифа",null,"Вид теплоносителя",{"$nulls":3},"Величина установленного тарифа",null,null,"Примечание"]
[{"$nulls":20},"Одноставочный тариф, руб./Гкал","Двухставочный тариф"]
[{"$nulls":14},"Дата начала","Дата окончания",{"$nulls":5},"Ставка за энергию, руб./Гкал","Ставка за содержание тепловой мощности, руб./Гкал в час"]
{"$rows_left_out":19}
{"sheet":"Горячая вода (по компонентам)","index":6,"n_rows":35,"n_cols":39,"rows_kept":35,"hidden":true,"merged":[[2,2,2,6],[3,2,4,23],[5,2,5,23],[7,2,10,2],[7,3,10,3],[7,4,10,6],[7,7,10,9],[7,10,10,12],[7,13,10,15],[7,16,10,16],[7,17,10,17],[7,18,7,20],[7,21,8,22],[7,23,10,23],[8,18,10,18],[8,19,8,20],[9,19,10,19],[9,20,10,20],[9,21,10,21],[9,22,10,22],[11,4,11,6],[11,7,11,9],[11,10,11,12],[11,13,11,15],[12,2,17,2],[12,3,17,3],[12,4,16,4],[12,5,16,5],[12,6,16,6],[12,7,15,7],[12,8,15,8],[12,9,15,9],[12,10,14,10],[12,11,14,11],[12,12,14,12],[12,13,13,13],[12,14,13,14],[12,15,13,15],[12,16,13,16],[12,17,13,17],[14,15,14,16],[15,12,15,13],[16,9,16,11],[17,6,17,8],[18,2,23,2],[18,3,23,3],[18,4,22,4],[18,5,22,5],[18,6,22,6],[18,7,21,7],[18,8,21,8],[18,9,21,9],[18,10,20,10],[18,11,20,11],[18,12,20,12],[18,13,19,13],[18,14,19,14],[18,15,19,15],[18,16,19,16],[18,17,19,17],[20,15,20,16],[21,12,21,13],[22,9,22,11],[23,6,23,8],[24,3,24,23],[26,3,28,12],[30,3,32,12],[34,3,41,12]]}
[]
[]
[null,null,{"$f":"Getcode()","v":"ELPASS.JKH.OPEN.INFO.PRICE.WARM"},{"$nulls":20},{"$f":"Инструкция!version","v":"Версия 1.0 от 01.10.2017"}]
[null,null,"Информация о тарифе на горячую воду в открытых системах горячего водоснабжения с учетом компонентов*"]
[]
[null,null,"ООО \"Мечел-энерго\""]
[]
[null,null,"№\nп/п","Тариф","Поставщик",null,null,"Территория действия тарифа",null,null,"Система теплоснабжения",null,null,"Условия применения \nдифференциации***",null,null,"Группа потребителей****","с НДС","Величина установленного тарифа",null,null,"Срок действия тарифа",null,"Примечание"]
[{"$nulls":18},"Одноставочный тариф","Двухставочный тариф"]
[{"$nulls":19},"Ставка за тепловую энергию, руб./Гкал","Ставка за содержание тепловой мощности, руб./Гкал в час","Дата начала","Дата окончания"]
{"$rows_left_out":26}
{"sheet":"Плата за подключение","index":7,"n_rows":24,"n_cols":46,"rows_kept":24,"hidden":true,"merged":[[2,3,2,6],[3,3,4,25],[5,3,5,25],[7,3,13,5],[7,6,13,8],[7,9,13,11],[7,12,11,15],[7,16,11,17],[7,18,11,19],[7,20,13,20],[7,21,13,21],[7,22,13,22],[7,23,11,24],[7,25,13,25],[12,12,13,14],[12,15,13,15],[12,16,13,16],[12,17,13,17],[12,18,13,18],[12,19,13,19],[12,23,13,23],[12,24,13,24],[14,3,14,5],[14,6,14,8],[14,9,14,11],[14,12,14,14],[15,3,19,3],[15,4,19,4],[15,5,19,5],[15,6,18,6],[15,7,18,7],[15,8,18,8],[15,9,17,9],[15,10,17,10],[15,11,17,11],[15,12,16,12],[15,13,16,13],[15,14,16,14],[15,15,16,15],[15,16,16,16],[15,17,16,17],[15,18,16,18],[15,19,16,19],[15,20,16,20],[15,21,16,21],[17,14,17,15],[18,11,18,12],[19,8,19,13],[20,5,20,8],[23,3,30,15]]}
[]
[]
[{"$nulls":3},{"$f":"Getcode()","v":"ELPASS.JKH.OPEN.INFO.PRICE.WARM"},{"$nulls":21},{"$f":"Инструкция!version","v":"Версия 1.0 от 01.10.2017"}]
[{"$nulls":3},"Информация о плате за подключение к системе теплоснабжения"]
[]
[{"$nulls":3},"ООО \"Мечел-энерго\""]
[]
[{"$nulls":3},"Территория действия тарифа",null,null,"Система теплоснабжения",null,null,"Наименование источника тепловой энергии",null,null,"Подключаемая тепловая нагрузка, Гкал/ч",{"$nulls":3},"Тип прокладки тепловых сетей",null,"Диаметр тепловых сетей",null,"Группа потребителей*","С НДС","Величина платы за подключение (технологическое присоединение) к системе теплоснабжения, тыс.руб./Гкал/ч","Срок действия тарифа",null,"Примечание"]
[]
[]
{"$rows_left_out":15}
{"sheet":"Формы 12-13","index":8,"n_rows":23,"n_cols":7,"rows_kept":23,"merged":[[3,3,3,4],[5,3,5,6],[10,3,10,6],[20,3,21,6],[22,3,23,6]]}
[]
[]
[{"$nulls":3},{"$f":"Getcode()","v":"ELPASS.JKH.OPEN.INFO.PRICE.WARM"},null,null,{"$f":"Инструкция!version","v":"Версия 1.0 от 01.10.2017"}]
[]
[]
[{"$nulls":3},"Форма 12. Информация* об условиях, на которых осуществляется подставка регулируемых товаров и (или) оказание регулируемых услуг*"]
[]
[null,3,null,"Информация, подлежащая раскрытию","Значение","Ссылка на документ, размещенный в Файловом хранилище документов Системы Эльпас","Примечание"]
[{"$nulls":3},"Информация об условиях, на которых осуществляется поставка товаров (оказания услуг), содержит сведения об условиях публичных договоров поставок регулируемых товаров (оказания регулируемых услуг), а также сведения о договорах, заключенных в соответствии с частями 2.1 и 2.2 статьи 8 Федерального закона \"О теплоснабжении\" (Собрание законодательства РФ 2010, № 31, ст. 4159; 2011, №23, ст. 3263; № 50, ст. 7359; 2012, № 53, ст. 7616, 7643; 2013, № 19, ст. 2330; 2014, № 30, ст. 4218; № 42, ст. 5615; № 49 (часть VI), ст. 6913)",null,"http://eias-elpas.bashkortostan.ru/UserFile/Download?guid=c68583aa-70de-4cf8-90a3-785c5edefd56"]
[null,3]
{"$rows_left_out":14}
{"sheet":"Публикация информации","index":9,"n_rows":15,"n_cols":7,"rows_kept":15,"merged":[[2,3,2,4],[3,3,3,4],[5,3,6,5],[7,3,7,5],[8,3,8,6]]}
[]
[]
[{"$nulls":3},{"$f":"Getcode()","v":"ELPASS.JKH.OPEN.INFO.PRICE.WARM"},null,{"$f":"Инструкция!version","v":"Версия 1.0 от 01.10.2017"}]
[]
[]
[{"$nulls":3},"Публикация информации по решению организации на ее официальном сайте"]
[]
[{"$nulls":3},"ООО \"Мечел-энерго\""]
[null,3]
[null,3,null,"№ п/п","Описание опубликованной информации","Адрес страницы сайта, на которой размещена информация"]
{"$rows_left_out":6}
{"sheet":"Комментарий","index":10,"n_rows":11,"n_cols":4,"rows_kept":11,"merged":[[2,1,2,2],[3,1,5,2],[7,1,7,2]]}
[]
[]
[null,{"$f":"Getcode()&\"                                                                                                \"&Инструкция!version","v":"ELPASS.JKH.OPEN.INFO.PRICE.WARM                                                                                                Версия 1.0 от 01.10.2017"}]
[null,{"$f":"GetTemplateName()","v":"Показатели, подлежащие раскрытию в сфере теплоснабжения и сфере оказания услуг по передаче тепловой энергии (цены и тарифы)"}]
[]
[]
[]
[null,"Комментарии регулируемой организации"]
[null,"№","Комментарий"]
[null,1]
{"$rows_left_out":2}
{"sheet":"Ошибки и предупреждения","index":11,"n_rows":4,"n_cols":4,"rows_kept":4,"merged":[[1,1,1,3]]}
[]
[null,"Результат проверки"]
[]
[null,"Ссылка","Причина","Статус"]

{"sheet":"Columns","index":12,"n_rows":0,"n_cols":0,"rows_kept":0,"hidden":true}

{"sheet":"Rows","index":13,"n_rows":119,"n_cols":46,"rows_kept":119,"hidden":true,"merged":[[3,3,7,3],[3,4,7,4],[3,5,7,5],[3,6,6,6],[3,7,6,7],[3,8,6,8],[3,9,5,9],[3,10,5,10],[3,11,5,11],[3,12,5,12],[3,13,5,13],[3,14,4,14],[3,15,4,15],[4,18,4,19],[6,11,6,12],[7,8,7,9],[9,6,12,6],[9,7,12,7],[9,8,12,8],[9,9,11,9],[9,10,11,10],[9,11,11,11],[9,12,11,12],[9,13,11,13],[9,14,10,14],[9,15,10,15],[10,18,10,19],[12,11,12,12],[14,9,16,9],[14,10,16,10],[14,11,16,11],[14,12,16,12],[14,13,16,13],[14,14,15,14],[14,15,15,15],[15,18,15,19],[18,14,19,14],[18,15,19,15],[23,4,27,4],[23,5,27,5],[23,6,27,6],[23,7,26,7],[23,8,26,8],[23,9,26,9],[23,10,25,10],[23,11,25,11],[23,12,25,12],[23,13,24,13],[23,14,24,14],[23,15,24,15],[23,16,24,16],[23,17,24,17],[25,15,25,16],[26,12,26,13],[27,9,27,11],[29,7,32,7],[29,8,32,8],[29,9,32,9],[29,10,31,10],[29,11,31,11],[29,12,31,12],[29,13,30,13],[29,14,30,14],[29,15,30,15],[29,16,30,16],[29,17,30,17],[31,15,31,16],[32,12,32,13],[34,10,36,10],[34,11,36,11],[34,12,36,12],[34,13,35,13],[34,14,35,14],[34,15,35,15],[34,16,35,16],[34,17,35,17],[36,15,36,16],[38,13,39,13],[38,14,39,14],[38,15,39,15],[38,16,39,16],[38,17,39,17],[45,3,49,3],[45,4,49,4],[45,5,49,5],[45,6,48,6],[45,7,48,7],[45,8,48,8],[45,9,47,9],[45,10,47,10],[45,11,47,11],[45,12,46,12],[45,13,46,13],[45,14,46,14],[45,15,46,15],[45,16,46,16],[45,17,46,17],[45,18,46,18],[45,19,46,19],[45,20,46,20],[45,21,46,21],[47,14,47,15],[48,11,48,12],[49,8,49,13],[51,6,54,6],[51,7,54,7],[51,8,54,8],[51,9,53,9],[51,10,53,10],[51,11,53,11],[51,12,52,12],[51,13,52,13],[51,14,52,14],[51,15,52,15],[51,16,52,16],[51,17,52,17],[51,18,52,18],[51,19,52,19],[51,20,52,20],[51,21,52,21],[53,14,53,15],[54,11,54,12],[56,12,57,12],[56,13,57,13],[56,14,57,14],[56,15,57,15],[56,16,57,16],[56,17,57,17],[56,18,57,18],[56,19,57,19],[56,20,57,20],[56,21,57,21],[64,9,66,9],[64,10,66,10],[64,11,66,11],[64,12,65,12],[64,13,65,13],[64,14,65,14],[64,15,65,15],[64,16,65,16],[64,17,65,17],[64,18,65,18],[64,19,65,19],[64,20,65,20],[64,21,65,21],[66,14,66,15],[68,3,73,3],[68,4,73,4],[68,5,73,5],[68,6,72,6],[68,7,72,7],[68,8,72,8],[68,9,71,9],[68,10,71,10],[68,11,71,11],[68,12,71,12],[68,13,71,13],[68,14,70,14],[68,15,70,15],[68,16,69,16],[68,17,69,17],[68,18,69,18],[70,18,70,19],[72,11,72,12],[73,8,73,9],[75,6,79,6],[75,7,79,7],[75,8,79,8],[75,9,78,9],[75,10,78,10],[75,11,78,11],[75,12,78,12],[75,13,78,13],[75,14,77,14],[75,15,77,15],[75,16,76,16],[75,17,76,17],[75,18,76,18],[77,18,77,19],[79,11,79,12],[81,9,84,9],[81,10,84,10],[81,11,84,11],[81,12,84,12],[81,13,84,13],[81,14,83,14],[81,15,83,15],[81,16,82,16],[81,17,82,17],[81,18,82,18],[83,18,83,19],[86,14,88,14],[86,15,88,15],[86,16,87,16],[86,17,87,17],[86,18,87,18],[88,18,88,19],[90,16,91,16],[90,17,91,17],[90,18,91,18],[93,4,97,4],[93,5,97,5],[93,6,97,6],[93,7,96,7],[93,8,96,8],[93,9,96,9],[93,10,95,10],[93,11,95,11],[93,12,95,12],[93,13,94,13],[93,14,94,14],[93,15,94,15],[93,16,94,16],[93,17,94,17],[95,15,95,16],[96,12,96,13],[97,9,97,11],[99,7,102,7],[99,8,102,8],[99,9,102,9],[99,10,101,10],[99,11,101,11],[99,12,101,12],[99,13,100,13],[99,14,100,14],[99,15,100,15],[99,16,100,16],[99,17,100,17],[101,15,101,16],[102,12,102,13],[104,10,106,10],[104,11,106,11],[104,12,106,12],[104,13,105,13],[104,14,105,14],[104,15,105,15],[104,16,105,16],[104,17,105,17],[106,15,106,16],[108,13,109,13],[108,14,109,14],[108,15,109,15],[108,16,109,16],[108,17,109,17],[113,4,114,4],[113,5,114,5],[113,6,114,6],[113,7,114,7],[114,8,114,9],[114,11,114,12],[116,1,118,1],[116,2,118,2],[116,3,118,3],[116,4,117,4],[116,5,117,5],[116,6,117,6],[116,7,117,7],[117,8,117,9],[117,11,117,12]]}
["add_COMMENTS_range","лист Комментарий"]
[]
["add_TERRITORY_range","лист Информация о тарифе"]
[{"$nulls":4},"1",null,"нет","1",null,null,"1",{"$nulls":3},{"$f":"List02_StartDate","v":"2018-07-26"},{"$f":"IF(MONTH(O4)<7,\"30.06.\",\"31.12.\")&YEAR(O4)","v":"31.12.2018"},null,1]
[{"$nulls":18},"Добавить теплоноситель",{"$nulls":18},"add_COOLANT_range"]
[{"$nulls":35},"add_PERIOD_range"]
[{"$nulls":11},"Добавить строку",{"$nulls":18},"add_TARIF_range"]
[{"$nulls":8},"Добавить систему",{"$nulls":18},"add_SYSTEM_range"]
["add_SYSTEM_range","лист Информация о тарифе"]
[{"$nulls":7},"1",null,null,"1",{"$nulls":3},{"$f":"List02_StartDate","v":"2018-07-26"},{"$f":"IF(MONTH(O10)<7,\"30.06.\",\"31.12.\")&YEAR(O10)","v":"31.12.2018"},null,1]
{"$rows_left_out":110}
{"sheet":"Reference","index":14,"n_rows":9,"n_cols":11,"rows_kept":9,"hidden":true}
["http://eias-elpas.bashkortostan.ru/UserFile/Download?guid=","Да/нет\n(BOOL)","Виды ставок\n(Rate)","Режим налогообложения\n(Tax)","Учет НДС\n(VAT_accounting)","Условие учета НДС\n(Condition_tax)","Территории","Виды тарифов\n(Tariff)","Единицы измерения","Вид теплоносителя","Виды деятельности \nActivity"]
[null,"да","Двухставочный тариф","Общий режим налогообложения","тариф не утверждался",{"$f":"IF(Титульный!List_01_tax_regime=\"Общий\",\"Reference_VAT_accounting0\",\"Reference_VAT_accounting1\")","v":"Reference_VAT_accounting0"},"Белорецкий муниципальный район (80611101)","Тариф на тепловую энергию (мощность)","руб./куб.м.","горячая вода","Производство тепловой энергии (мощности) в режиме комбинированной выработки электрической и тепловой энергии источниками тепловой энергии с установленной генерирующей мощностью производства электрической энергии 25 МВт и более"]
[null,"нет","Одноставочный тариф","Режим без уплаты НДС (общий режим с учетом освобождения от уплаты НДС или специальный: УСН, ЕСХН)","тариф указан без НДС",{"$f":"IF(Титульный!List_01_tax_regime=\"Общий\",\"Reference_VAT_accounting2\",\"Reference_VAT_accounting1\")","v":"Reference_VAT_accounting2"},null,"Тариф на теплоноситель","руб./Гкал в час","пар","Производство тепловой энергии (мощности) в режиме комбинированной выработки электрической и тепловой энергии источниками тепловой энергии с установленной генерирующей мощностью производства электрической энергии менее 25 МВт"]
[{"$nulls":4},"тариф указан с НДС",null,null,"Тариф на услуги по передаче теплоэнергии, теплоноситель","руб./Гкал","отборный пар, 1,2-2,5 кг/см2","Производство тепловой энергии (мощности) не в режиме комбинированной выработки электрической и тепловой энергии источниками тепловой энергии"]
[{"$nulls":7},"Плата за услуги по поддержанию резервной тепловой мощности при отсутствии потребления тепловой энергии","тыс. руб./Гкал/ч в мес","отборный пар, 2,5-7 кг/см2","Производство теплоносителя"]
[{"$nulls":7},"Плата за подключение (технологическое присоединение) к системе теплоснабжения",null,"отборный пар, 7-13 кг/см2","Передача тепловой энергии и теплоносителя"]
[{"$nulls":7},"Тариф на горячую воду, поставляемую с использованием открытых систем теплоснабжения (горячего водоснабжения)",null,"отборный пар, >13 кг/см2","Сбыт тепловой энергии и теплоносителя"]
[{"$nulls":9},"острый и редуцированный пар","Подключение к системе теплоснабжения"]
[{"$nulls":10},"Поддержание резервной тепловой мощности при отсутствии потребления тепловой энергии"]

{"sheet":"RegistryMunicipal","index":15,"n_rows":896,"n_cols":7,"rows_kept":896,"hidden":true}
["MO1","МО1_ОКТМО","ИМЯ ДИАПАЗОНА",null,"MO1","MO2","МО2_ОКТМО"]
["Абзелиловский муниципальный район","80601000","MO_LIST_2",null,"Абзелиловский муниципальный район"," Все муниципальные образования","80601000"]
["Альшеевский муниципальный район","80602000","MO_LIST_3",null,"Абзелиловский муниципальный район","Альмухаметовский сельский совет","80601404"]
["Архангельский муниципальный район","80603000","MO_LIST_4",null,"Абзелиловский муниципальный район","Амангильдинский сельский совет","80601407"]
["Аскинский муниципальный район","80604000","MO_LIST_5",null,"Абзелиловский муниципальный район","Аскаровский сельский совет","80601410"]
["Аургазинский муниципальный район","80605000","MO_LIST_6",null,"Абзелиловский муниципальный район","Баимовский сельский совет","80601413"]
["Баймакский муниципальный район","80606000","MO_LIST_7",null,"Абзелиловский муниципальный район","Бурангуловский сельский совет","80601416"]
["Бакалинский муниципальный район","80607000","MO_LIST_8",null,"Абзелиловский муниципальный район","Гусевский сельский совет","80601419"]
["Балтачевский муниципальный район","80608000","MO_LIST_9",null,"Абзелиловский муниципальный район","Давлетовский сельский совет","80601422"]
["Белебеевский муниципальный район","80609000","MO_LIST_10",null,"Абзелиловский муниципальный район","Кирдасовский сельский совет","80601425"]
{"$rows_left_out":887}
{"sheet":"SheetList","index":16,"n_rows":35,"n_cols":8,"rows_kept":35,"hidden":true,"merged":[[34,3,48,7]]}
["Расчетные листы","Скрытые листы"]
["Инструкция","Columns"]
["Титульный","Rows"]
["Параметры","Reference"]
["Территории","SheetList"]
["Информация о тарифе","RegistryMunicipal"]
["Тепловая энергия"]
["Горячая вода (по компонентам)"]
["Плата за подключение"]
["Формы 12-13"]
{"$rows_left_out":17}